debian: include mkdocs documentation

Signed-off-by: Rémi Duraffort <remi.duraffort@linaro.org>
18 jobs for mkdocs in 18 minutes and 12 seconds (queued for 7 seconds)
latest
Status Job ID Name Coverage
  Test
passed #134990
amd64
dispatcher-debian-10

00:02:33

passed #134992
amd64
dispatcher-debian-11

00:02:33

passed #134991
amd64
server-debian-10

00:03:03

passed #134993
amd64
server-debian-11

00:05:23

 
  Analyze
passed #134994
amd64-dind
bandit-sast

00:01:29

passed #134997
amd64
black

00:00:59

passed #134998
amd64
code_quality

00:00:43

passed #135003
amd64
codespell

00:00:31

passed #134999
amd64
coverage

00:07:31

61.09%
passed #135000
amd64
dockerfiles

00:00:24

passed #134995
amd64-dind
eslint-sast

00:00:41

passed #135002
amd64
pylint

00:03:07

passed #135001
amd64
schemas

00:00:56

passed #134996
amd64-dind
semgrep-sast

00:01:39

 
  Build
failed #135005
amd64
debian/10

00:01:10

passed #135004
amd64
doc

00:00:36

passed #135006
amd64-dind
docker-amd64-dispatcher

00:04:18

passed #135007
amd64-dind
docker-amd64-server

00:05:13

 
Name Stage Failure
failed
debian/10 Build
Aborted with 1 Configuration Errors!
make[1]: *** [debian/rules:56: override_dh_auto_build] Error 1
make[1]: Leaving directory '/builds/ivoire/lava/_build/lava-2020.08.0591.gaf35e0f5f'
make: *** [debian/rules:35: build] Error 2
dpkg-buildpackage: error: debian/rules build subprocess returned exit status 2
debuild: fatal error at line 1182:
dpkg-buildpackage -us -uc -ui -sa failed
Cleaning up file based variables
ERROR: Job failed: exit code 1