debian: include mkdocs documentation

Signed-off-by: Rémi Duraffort <remi.duraffort@linaro.org>
16 jobs for mkdocs in 16 minutes and 9 seconds (queued for 4 seconds)
latest
Status Job ID Name Coverage
  Test
passed #112125
amd64
dispatcher-debian-10

00:02:16

passed #112127
amd64
dispatcher-debian-11

00:02:19

passed #112126
amd64
server-debian-10

00:02:41

passed #112128
amd64
server-debian-11

00:04:46

 
  Analyze
passed #112129
amd64-dind
bandit-sast

00:00:49

passed #112130
amd64
black

00:00:32

passed #112131
amd64
code_quality

00:00:18

passed #112136
amd64
codespell

00:00:13

passed #112132
amd64
coverage

00:06:49

60.66%
passed #112133
amd64
dockerfiles

00:00:12

passed #112135
amd64
pylint

00:02:55

passed #112134
amd64
schemas

00:00:26

 
  Build
failed #112138
amd64
debian/10

00:00:55

passed #112137
amd64
doc

00:00:36

passed #112139
amd64-dind
docker-amd64-dispatcher

00:03:43

passed #112140
amd64-dind
docker-amd64-server

00:04:30

 
Name Stage Failure
failed
debian/10 Build

Aborted with 1 Configuration Errors!
make[1]: *** [debian/rules:49: override_dh_auto_build] Error 1
make[1]: Leaving directory '/builds/ivoire/lava/_build/lava-2020.08.0112.g732c9291a'
make: *** [debian/rules:34: build] Error 2
dpkg-buildpackage: error: debian/rules build subprocess returned exit status 2
debuild: fatal error at line 1182:
dpkg-buildpackage -us -uc -ui -sa failed
ERROR: Job failed: exit code 1